{"text_format":"1","workbook":"xlsx","n_sheets":7,"sheets":["Job Aid ","UPDATES","Wage Earner Income Calculator","Variable Pay","Withholdings Validation","2106 Worksheet","Income Red Flag Job Aid"],"not_rendered":{"charts":0,"images":3,"macros":1,"external_links":2,"defined_names":7,"comments":5,"pivot_tables":0},"unopened":[],"bounds":{"document_bytes":16777216,"sheet_cells":100000,"rows_first":2000,"rows_last":500,"rows_between":2000,"halvings":0,"cell_chars":16384,"cell_head_chars":4096},"cells_cut":0,"cells_raw":0,"read":"whole","date_system":"1900"}

{"sheet":"Job Aid ","index":0,"n_rows":70,"n_cols":49,"rows_kept":70,"cut":false,"hidden":true,"merged":[[69,1,69,16],[64,4,64,16],[66,2,66,3],[66,9,66,11],[66,12,66,16],[62,5,62,7],[62,8,62,12],[62,13,62,14],[68,2,68,3],[68,4,68,16],[62,15,62,16],[57,4,57,16],[58,4,58,7],[58,8,58,11],[58,12,58,16],[46,1,47,1],[47,2,47,16],[48,2,49,3],[48,4,49,4],[48,5,49,7],[54,9,55,12],[54,13,55,16],[56,4,56,7],[56,9,56,12],[56,13,56,16],[46,2,46,16],[52,8,52,11],[52,12,52,16],[53,2,53,3],[53,9,53,12],[53,13,53,16],[44,14,44,16],[48,8,49,8],[0,1,0,16],[2,3,3,7],[2,1,3,2],[1,10,1,14],[1,15,3,16],[1,8,1,9],[15,14,15,16],[39,1,41,1],[39,2,39,13],[41,2,41,16],[32,3,32,4],[33,2,33,3],[21,5,21,8],[20,5,20,8],[30,3,30,4],[25,2,25,16],[48,9,49,10],[48,11,49,12],[48,13,49,16],[1,4,1,7],[2,8,3,9],[2,10,3,14],[13,1,14,1],[34,2,34,4],[23,3,24,4],[31,9,31,13],[32,9,32,13],[15,5,15,8],[26,2,26,4],[27,9,27,13],[26,14,26,16],[26,9,26,13],[27,5,27,8],[15,9,15,13],[16,9,17,13],[21,2,21,4],[22,5,22,8],[23,5,23,8],[18,9,23,16],[22,2,22,3],[20,2,20,4],[18,5,18,8],[19,5,19,8],[19,2,19,4],[18,2,18,4],[24,14,24,16],[9,12,9,13],[9,10,9,11],[9,14,9,16],[9,7,9,9],[4,1,6,16],[7,1,7,7],[7,8,7,10],[7,11,7,16],[27,2,27,4],[8,1,8,16],[9,4,9,6],[9,1,10,1],[10,4,10,6],[10,10,10,11],[9,2,10,3],[10,7,10,9],[11,7,11,8],[11,9,11,12],[10,12,10,13],[16,14,17,16],[17,5,17,8],[10,14,10,16],[12,2,12,16],[15,2,15,4],[11,2,11,3],[17,3,17,4],[16,2,17,2],[11,4,11,6],[14,2,14,16],[16,3,16,4],[16,5,16,8],[13,2,13,16],[11,13,11,16],[24,5,24,13],[28,3,28,4],[29,3,29,4],[50,11,50,12],[50,13,50,16],[36,5,36,8],[37,5,37,8],[38,2,38,13],[37,3,37,4],[28,2,29,2],[29,5,29,8],[43,9,43,13],[42,5,42,8],[40,2,40,16],[42,9,42,13],[42,14,42,16],[43,5,43,8],[43,14,43,16],[36,2,36,4],[36,9,36,13],[35,2,35,4],[34,5,34,8],[31,5,31,8],[28,9,29,13],[61,2,61,3],[61,9,61,12],[61,13,61,16],[62,2,62,4],[61,5,61,7],[67,4,67,7],[67,8,67,10],[63,2,63,3],[63,5,63,8],[63,9,63,10],[66,4,66,7],[63,11,63,14],[64,2,64,3],[65,2,65,3],[65,4,65,7],[65,12,65,16],[65,9,65,11],[63,15,63,16],[60,5,60,7],[50,5,50,7],[50,9,50,10],[43,2,43,4],[42,2,42,4],[58,2,58,3],[57,2,57,3],[53,5,53,7],[50,2,50,3],[52,2,52,3],[51,2,51,3],[51,4,51,16],[52,4,52,7],[54,2,56,3],[54,4,55,7],[54,8,56,8],[59,4,59,16],[60,2,60,3],[59,2,59,3],[60,13,60,16],[60,9,60,12],[44,2,44,3],[44,5,44,8],[44,9,44,13],[27,14,27,16],[26,5,26,8],[28,5,28,8],[28,14,39,16],[37,9,37,13],[35,5,35,8],[35,9,35,13],[30,5,30,8],[30,9,30,13],[32,5,32,8],[33,5,33,8],[34,9,34,13],[33,9,33,13]]}
[null,"WAGE EARNER CALCULATOR WORKSHEET",null,null,null,null,null,null,null,null,null,null,null,null,null,null,null," "]
[null,"DATE",{"$f":"TODAY()","v":"2020-01-31"},"Loan #",null,null,null,null,"Completed By:",null,null,null,null,null,null,"1900-01-01"]
[null,"Applicant Name:",null,null,null,null,null,null,"Employer Name:",null,null,null,null,null,null,null,null," "]
[]
[null,"THIS IS A TOOL AND DOES NOT REPLACE ASSOCIATE ACCOUNTABILITY FOR ACCURATE DETERMINATION AND DOCUMENTATION OF QUALIFYING INCOME. \nQualifying Income Reminders - Refer to the policy guide for detailed income policy requirements. \n* Always compare the income documentation information to the 1003 information\n* All income used for qualification must be stable with a two year history and reasonably expected to continue for the next 3 years. \n* For income to be considered stable and likely to continue - it must be supported by a two year history and current earnings that show a consistent and/or \n  increasing level of monthly income. \n* Documentation is required in the loan file to support verification of income sources, income calculations and the determination of stable income. ",null,null,null,null,null,null,null,null,null,null,null,null,null,null,null,null,null,null,null,null,null,null,null,null,null,null,null,null,null,null,null,null,null,null,"Frequency?",{"$f":"IF(AND(0<K11,K11<2.99),(1),(0))","v":0},"Frequency?",null,{"$f":"MONTH(H11)","v":{"$error":"#VALUE!"}},{"$f":"DAY(H11)","v":{"$error":"#VALUE!"}},{"$f":"YEAR(H11)","v":{"$error":"#VALUE!"}},null,{"$f":"MONTH(#REF!)","v":{"$error":"#REF!"}},{"$f":"DAY(#REF!)","v":{"$error":"#REF!"}},{"$f":"YEAR(#REF!)","v":{"$error":"#REF!"}}]
[null,null,null,null,null,null,null,null,null,null,null,null,null,null,null,null,null,null,null,null,null,null,null,null,null,null,null,null,null,null,null,null,null,null,null,null,"Annually",{"$f":"IF(AND(2.9999<K11,K11<5.99),(2),(0))","v":0},"12 Months",null,{"$f":"IF(AO5=1,(31),IF(AO5=2,(28),IF(AO5=3,(31),IF(AO5=4,(30),IF(AO5=5,(31),IF(AO5=6,(30),IF(AO5=7,(31),IF(AO5=8,(31)))))))))","v":{"$error":"#VALUE!"}},null,null,null,{"$f":"IF(AS5=1,(31),IF(AS5=2,(28),IF(AS5=3,(31),IF(AS5=4,(30),IF(AS5=5,(31),IF(AS5=6,(30),IF(AS5=7,(31),IF(AS5=8,(31)))))))))","v":{"$error":"#REF!"}}]
[null,null,null,null,null,null,null,null,null,null,null,null,null,null,null,null,null,null,null,null,null,null,null,null,null,null,null,null,null,null,null,null,null,null,null,null,"Monthly/Quarterly",{"$f":"IF(AND(6<K11,K11<8.99),(3),(0))","v":0},"11 Months",null,{"$f":"IF(AO5=9,(30),IF(AO5=10,(31),IF(AO5=11,(30),IF(AO5=12,(31)))))","v":{"$error":"#VALUE!"}},{"$f":"AO5-1","v":{"$error":"#VALUE!"}},null,null,{"$f":"IF(AS5=9,(30),IF(AS5=10,(31),IF(AS5=11,(30),IF(AS5=12,(31)))))","v":{"$error":"#REF!"}},{"$f":"AS5-1","v":{"$error":"#REF!"}},null,null," "]
[null,"Data entry is REQUIRED in ALL SECTIONS - ",null,null,null,null,null,null,"YELLOW FIELDS",null,null," - White fields auto-calculate.",null,null,null,null,null,null,null,null,null,null,null,null,null,null,null,null,null,null,null,null,null,null,null,null,"Quarterly",{"$f":"IF(AND(9<K11,K11<12.1),(4),(0))","v":0},"10 Months",null,{"$f":"SUM(AO6:AO7)","v":{"$error":"#VALUE!"}},{"$f":"AP5/AO8","v":{"$error":"#VALUE!"}},null,null,{"$f":"SUM(AS6:AS7)","v":{"$error":"#REF!"}},{"$f":"AT5/AS8","v":{"$error":"#REF!"}},null,null," "]
[null,"To make data entry corrections always use the DELETE key.  Use arrow keys to move from cell to cell - ensure Scroll Lock is not on.  \nWhen entering comments, use the ALT and ENTER key together to start new row. ",null,null,null,null,null,null,null,null,null,null,null,null,null,null,null,null,null,null,null,null,null,null,null,null,null,null,null,null,null,null,null,null,null,null,null,null,"9 Months",null,null,{"$f":"ROUND(AP8,2)","v":{"$error":"#VALUE!"}}]
[null,1,"Current Paystub \nYTD Earnings Calculation \n(paystub must have YTD gross earnings and withholdings or a written VOE is required)",null,"Current  Employer \nYTD Gross Pay",null,null,"Pay Period Ending Date\nMUST BE Most Recent 30 Days\nMM/DD/YY",null,null,"# of Months",null,"Monthly Average Income",null,"Has the applicant worked for \nthis employer since January of this year?  ",null,null,null,null," ",null,null,null,null,null,null,null,null,null,null,null,null,null,null,null,null,null,{"$f":"SUM(AL5:AL8)","v":0},null,null,null,{"$f":"SUM(AP7+AP9)","v":{"$error":"#VALUE!"}},null,null,null,{"$f":"SUM(AT7:AT8)","v":{"$error":"#REF!"}},null,null," "]
{"$rows_left_out":61}
{"sheet":"UPDATES","index":1,"n_rows":31,"n_cols":3,"rows_kept":31,"cut":false,"hidden":false,"merged":[[0,0,0,2]]}
["UPDATE LOG"]
["Date","Description","Author"]
["2013-02-04","Updated to add mileage for 2012. "]
["2013-04-05","Update all tabs to standard processes."]
["2013-07-19","Password Protect Fields","Michael Stalnaker"]
["2013-07-22","Correct Prior Employer Name Field in O13","Michael Stalnaker"]
["2013-07-22","Correct Formula and Format in Cell F62 and N62","Michael Stalnaker"]
["2013-10-26","Added Variable Pay Tab","Michael Stalnaker"]
["2013-10-26","Changed order of entry - YTD, 2012, 2011","Michael Stalnaker"]
["2013-10-26","Updated formulas to coincide with Order of Entry","Michael Stalnaker"]
{"$rows_left_out":22}
{"sheet":"Wage Earner Income Calculator","index":2,"n_rows":69,"n_cols":49,"rows_kept":69,"cut":false,"hidden":false,"merged":[[46,1,47,1],[37,5,37,8],[36,5,36,8],[52,9,52,12],[52,13,52,16],[37,9,37,13],[40,1,41,1],[38,9,38,13],[44,5,44,8],[44,9,44,13],[43,9,43,13],[43,5,43,8],[48,5,49,7],[50,13,50,16],[50,5,50,7],[37,2,37,4],[39,2,39,4],[39,5,39,8],[39,9,39,13],[38,2,38,4],[33,9,33,13],[26,2,26,16],[29,2,29,4],[40,2,40,16],[30,3,30,4],[36,14,36,16],[34,9,34,13],[31,3,31,4],[28,2,28,4],[33,14,33,16],[28,14,28,16],[33,5,33,8],[32,2,32,4],[27,2,27,16],[30,5,30,6],[31,5,31,6],[30,7,30,8],[31,7,31,8],[30,9,30,10],[31,9,31,10],[30,15,30,16],[31,15,31,16],[30,11,30,13],[31,11,31,13],[53,5,53,7],[53,9,53,12],[50,11,50,12],[51,2,51,3],[56,9,56,12],[50,9,50,10],[50,2,50,3],[54,9,55,12],[43,2,43,4],[54,4,55,7],[56,4,56,7],[54,8,56,8],[53,2,53,3],[48,8,49,8],[48,2,49,3],[48,4,49,4],[52,5,52,7],[51,4,51,16],[53,13,53,16],[52,2,52,3],[47,17,47,20],[47,2,47,16],[44,14,44,16],[46,2,46,16],[34,3,34,4],[34,14,34,16],[35,5,35,8],[42,9,42,13],[35,2,35,3],[36,2,36,4],[36,9,36,13],[42,2,42,4],[38,5,38,8],[35,9,35,13],[34,5,34,8],[44,2,44,4],[60,13,60,16],[61,13,61,16],[61,2,61,3],[61,9,61,12],[60,9,60,12],[59,2,59,3],[57,2,57,3],[54,2,56,3],[57,4,57,16],[59,4,59,16],[54,13,55,16],[56,13,56,16],[58,2,58,3],[58,12,58,16],[58,4,58,7],[61,5,61,7],[60,5,60,7],[60,2,60,3],[58,8,58,11],[21,5,21,8],[24,9,24,13],[25,14,25,16],[25,5,25,13],[29,5,29,8],[21,9,21,13],[21,2,21,4],[18,14,18,16],[24,2,24,4],[25,2,25,4],[23,2,23,3],[22,2,22,4],[22,5,22,8],[22,9,22,13],[22,14,22,16],[24,5,24,8],[32,5,32,8],[19,9,19,13],[20,9,20,13],[14,2,14,16],[12,13,12,16],[17,3,17,4],[16,3,16,4],[19,5,19,8],[17,5,17,8],[15,5,15,8],[15,9,15,13],[15,14,15,16],[15,2,15,4],[12,4,12,6],[12,2,12,3],[19,14,19,16],[16,9,17,13],[18,2,18,4],[20,2,20,4],[19,2,19,4],[18,9,18,13],[18,5,18,8],[20,5,20,8],[20,14,20,16],[30,2,31,2],[13,1,14,1],[11,2,11,3],[9,7,9,9],[10,7,10,9],[11,4,11,6],[4,1,6,16],[7,1,7,7],[11,9,11,12],[16,2,17,2],[16,14,17,16],[16,5,16,8],[13,2,13,16],[12,9,12,12],[12,7,12,8],[29,14,29,16],[29,9,29,13],[28,5,28,8],[21,14,21,16],[23,14,23,16],[28,9,28,13],[24,14,24,16],[23,9,23,13],[23,5,23,8],[0,1,0,16],[2,3,3,7],[2,1,3,2],[1,10,1,14],[1,15,3,16],[1,8,1,9],[2,10,3,14],[11,13,11,16],[9,14,9,16],[8,1,8,16],[10,14,10,16],[9,1,10,1],[1,4,1,7],[2,8,3,9],[9,2,10,3],[10,10,10,11],[10,12,10,13],[11,7,11,8],[7,8,7,10],[7,11,7,16],[9,12,9,13],[9,10,9,11],[9,4,9,6],[10,4,10,6],[63,15,63,16],[67,2,67,3],[67,4,67,16],[65,12,65,16],[65,9,65,11],[66,2,66,3],[66,9,66,11],[66,12,66,16],[65,2,65,3],[63,5,63,8],[63,9,63,10],[66,4,66,7],[65,4,65,7],[68,1,68,2],[62,8,62,12],[62,13,62,14],[35,14,35,16],[32,14,32,16],[32,9,32,13],[43,1,44,1],[43,14,43,16],[38,14,38,16],[48,13,49,16],[48,11,49,12],[48,9,49,10],[37,14,37,16],[42,14,42,16],[42,5,42,8],[41,2,41,16],[39,14,39,16],[62,15,62,16],[64,2,64,3],[62,2,62,4],[62,5,62,7],[64,4,64,16],[63,2,63,3],[63,11,63,14]]}
[null,"WAGE EARNER CALCULATOR WORKSHEET\n\"PROPRIETARY TO MOUNTAIN WEST FINANCIAL - INTERNAL USE ONLY\"",null,null,null,null,null,null,null,null,null,null,null,null,null,null,null," "]
[null,"DATE",{"$f":"TODAY()","v":"2020-01-31"},"Loan #",null,null,null,null,"Completed By:",null,null,null,null,null,null,"1900-01-01"]
[null,"Applicant Name:",null,null,null,null,null,null,"Employer Name:",null,null,null,null,null,null,null,null," "]
[]
[null,null,null,null,null,null,null,null,null,null,null,null,null,null,null,null,null,null,null,null,null,null,null,null,null,null,null,null,null,"2019 Average",null,null,"Pystub Aging",{"$f":"C2-H11","v":43861},null,null,"Frequency?",{"$f":"IF(AND(0<K11,K11<2.99),(1),(0))","v":0},"Frequency?",null,{"$f":"MONTH(H11)","v":1},{"$f":"DAY(H11)","v":0},{"$f":"YEAR(H11)","v":1900},null,{"$f":"MONTH(C13)","v":1},{"$f":"DAY(C13)","v":0},{"$f":"YEAR(C13)","v":1900}]
[null,null,null,null,null,null,null,null,null,null,null,null,null,null,null,null,null,null,null,null,null,null,null,null,null,null,null,null,null,"2018 Average",null,null,null,null,null,null,"Annually",{"$f":"IF(AND(2.9999<K11,K11<5.99),(2),(0))","v":0},"12 Months",null,{"$f":"IF(AO5=1,(31),IF(AO5=2,(28),IF(AO5=3,(31),IF(AO5=4,(30),IF(AO5=5,(31),IF(AO5=6,(30),IF(AO5=7,(31),IF(AO5=8,(31)))))))))","v":31},null,null,null,{"$f":"IF(AS5=1,(31),IF(AS5=2,(28),IF(AS5=3,(31),IF(AS5=4,(30),IF(AS5=5,(31),IF(AS5=6,(30),IF(AS5=7,(31),IF(AS5=8,(31)))))))))","v":31}]
[null,null,null,null,null,null,null,null,null,null,null,null,null,null,null,null,null,null,null,null,null,null,null,null,null,null,null,null,null,null,null,null,null,null,null,null,"Monthly/Quarterly",{"$f":"IF(AND(6<K11,K11<8.99),(3),(0))","v":0},"11 Months",null,{"$f":"IF(AO5=9,(30),IF(AO5=10,(31),IF(AO5=11,(30),IF(AO5=12,(31)))))","v":false},{"$f":"AO5-1","v":0},null,null,{"$f":"IF(AS5=9,(30),IF(AS5=10,(31),IF(AS5=11,(30),IF(AS5=12,(31)))))","v":false},{"$f":"AS5-1","v":0},null,null," "]
[null,null,null,null,null,null,null,null,null,null,null,null,null,null,null,null,null,null,null,null,null,null,null,null,null,null,null,null,null,null,null,null,null,null,null,null,"Quarterly",{"$f":"IF(AND(9<K11,K11<12.1),(4),(0))","v":0},"10 Months",null,{"$f":"SUM(AO6:AO7)","v":31},{"$f":"AP5/AO8","v":0},null,null,{"$f":"SUM(AS6:AS7)","v":31},{"$f":"AT5/AS8","v":0},null,null," "]
[null,null,null,null,null,null,null,null,null,null,null,null,null,null,null,null,null,null,null,null,null,null,null,null,null,null,null,null,null,null,null,null,null,null,null,null,null,null,"9 Months",null,null,{"$f":"ROUND(AP8,2)","v":0}]
[null,1,"Current Paystub \nYTD Earnings Calculation \n(paystub must have YTD gross earnings and withholdings or a written VOE is required)",null,"Current  Employer \nYTD Gross Pay",null,null,"Pay Period Ending Date\nMUST BE Most Recent 30 Days\nMM/DD/YY",null,null,"# of Months",null,"Monthly Average Income",null,"Has the applicant worked for \nthis employer since January of this year?  ",null,null,null,null," ",null,null,null,null,null,null,null,null,null,null,null,null,null,null,null,null,null,{"$f":"SUM(AL5:AL8)","v":0},null,null,null,{"$f":"SUM(AP7+AP9)","v":0},null,null,null,{"$f":"SUM(AT7:AT8)","v":0},null,null," "]
{"$rows_left_out":60}
{"sheet":"Variable Pay","index":3,"n_rows":38,"n_cols":25,"rows_kept":38,"cut":false,"hidden":false,"merged":[[0,1,0,10],[1,1,1,10],[2,4,2,6],[2,8,2,9],[3,1,3,6],[3,7,3,8],[3,9,3,10],[4,1,4,10],[5,2,5,10],[6,2,6,4],[6,5,6,6],[6,7,6,8],[6,9,6,10],[15,2,15,4],[6,19,6,20],[6,21,6,22],[6,23,6,24],[7,2,7,4],[7,6,8,6],[7,8,8,8],[7,10,8,10],[8,2,8,4],[11,2,11,4],[12,2,12,4],[13,2,13,4],[14,2,14,4],[10,3,10,4],[16,3,16,4],[17,2,17,4],[19,1,27,1],[19,2,19,4],[20,2,20,4],[21,2,21,4],[22,2,22,4],[23,2,23,4],[24,2,24,4],[25,2,25,4],[36,3,36,4],[37,2,37,4],[26,3,26,4],[27,2,27,4],[29,1,37,1],[29,2,29,5],[30,2,30,4],[31,2,31,4],[32,2,32,4],[33,2,33,4],[34,2,34,4],[35,2,35,4]]}
[null,"VARIABLE PAY FROM VOE",null,null,null,null,null,null,null,null,null," "]
[null,"VOEs FOR ALL PERIODS (YTD AND PRIOR YEARS) ARE REQUIRED TO USE THIS FORM"]
[null,"DATE",{"$f":"'Wage Earner Income Calculator'!C2","v":"2020-01-31"},"Loan #",{"$f":"IF('Wage Earner Income Calculator'!E2=\"\",\"\",'Wage Earner Income Calculator'!E2)","v":""},null,null,"Borrower:",{"$f":"IF('Wage Earner Income Calculator'!D3=\"\",\"\",'Wage Earner Income Calculator'!D3)","v":""}]
[null,"Data entry is REQUIRED in ALL SECTIONS - ",null,null,null,null,null,"fill in all YELLOW FIELDS",null," - White fields auto-calculate."]
[null,"To make data entry corrections always use the DELETE key.  Use arrow keys to move from cell to cell - ensure Scroll Lock is not on.  \nWhen entering comments, use the ALT and ENTER key together to start new row. "]
[null,null,"VARIABLE PAY",null,null,null,null,null,null,null,null," "]
[null,null,null,null,null,"YTD Gross",null,{"$f":"'Wage Earner Income Calculator'!J29","v":"2019 Average"},null,{"$f":"'Wage Earner Income Calculator'!O29","v":"2018 Average"},null,null,null,null,null,null,null,null,null,{"$f":"F7","v":"YTD Gross"},null,{"$f":"H7","v":"2019 Average"},null,{"$f":"J7","v":"2018 Average"}]
[null,null,"Employer Start Date (current year):",null,null,"2020-01-01",{"$f":"'Wage Earner Income Calculator'!K11","v":0},"2019-01-01",{"$f":"ROUND(W13,2)","v":12},"2018-01-01",{"$f":"ROUND(Y13,2)","v":12},null,null,null,null,null,null,null,null,{"$f":"MONTH(F8)","v":1},null,{"$f":"MONTH(H8)","v":1},{"$f":"DAY(H8)","v":1},{"$f":"MONTH(J8)","v":1},{"$f":"DAY(J8)","v":1}]
[null,null,"End Date:",null,null,{"$f":"IF('Wage Earner Income Calculator'!H11=\"\",\"\",'Wage Earner Income Calculator'!H11)","v":""},null,"2019-12-31",null,"2018-12-31",null,null,null,null,null,null,null,null,null,{"$f":"MONTH(F9)","v":{"$error":"#VALUE!"}},{"$f":"DAY(F9)","v":{"$error":"#VALUE!"}},{"$f":"MONTH(H9)","v":12},{"$f":"DAY(H9)","v":31},{"$f":"MONTH(J9)","v":12},{"$f":"DAY(J9)","v":31}]
[null,null,null,null,null,"Total","Average","Total","Average","Total","Average"]
{"$rows_left_out":29}
{"sheet":"Withholdings Validation","index":4,"n_rows":37,"n_cols":11,"rows_kept":37,"cut":false,"hidden":false,"merged":[[1,0,3,7],[4,1,4,7],[5,5,6,7],[8,3,8,4],[8,5,11,7],[18,8,18,11],[19,8,19,11],[18,6,19,7],[14,1,14,7],[36,1,36,4],[32,1,34,7],[15,1,15,7],[24,1,24,2],[22,1,22,7],[17,8,17,11]]}
[]
["When the pay stub and / or W-2 do not reflect gross earnings, Social Security taxes, withholding taxes or other deductions, the use of alternative income documentation is not acceptable and full documentation must obtained. \n\nFiles that have unresolved issues or numerous red flags must be referred to a Supervisor. The QC Department must be notified of each fraud incident uncovered during the process."]
[]
[null,null,null,null,null,null,null,null,null,null," "]
["Guidance"," PAYSTUB WITHHOLDING VALIDATION\n\nCompare paystub withholdings to the High/Low ranges below - withholdings outside of this range \nare a potential red flag and require further review. \n\nCalculating exact withholdings on a current paystub is difficult due to the many variables for pre-tax deductions and employer methods.  \nGiven these variables a \"withholding range\" has been established to validate withholdings to the current paystub.  \nNote:Social Security (FICA) will be based on the lower of the actual or max earnings limit for current year per table below. "]
[null,null,null,null,null," "]
["Step 1",null,"YTD Gross Income",{"$f":"'Wage Earner Income Calculator'!E11","v":0}]
[]
[null,null,null,"Withholdings on paystub should be within the ranges below. ",null," ",null,null," "]
[null,null,null,"High","Low"]
{"$rows_left_out":28}
{"sheet":"2106 Worksheet","index":5,"n_rows":11,"n_cols":19,"rows_kept":11,"cut":false,"hidden":false,"merged":[[10,2,10,5],[5,2,5,5],[6,2,6,6],[7,2,7,6],[9,2,9,5],[8,2,8,4],[0,1,0,18],[4,17,5,17],[2,18,5,18],[4,13,5,15],[4,16,5,16],[1,3,1,12],[2,3,2,12],[3,3,3,12],[1,13,3,15],[4,3,4,12]]}
[null,"2106 Worksheet"]
[null,null,"Applicant:",{"$f":"IF('Wage Earner Income Calculator'!D3=\"\",\"\",'Wage Earner Income Calculator'!D3)","v":""},null,null,null,null,null,null,null,null,null,"Auto Calcs Most Conservative"]
[null,null,"Loan #:",{"$f":"IF('Wage Earner Income Calculator'!E2=\"\",\"\",'Wage Earner Income Calculator'!E2)","v":""},null,null,null,null,null,null,null,null,null,null,null,null,null," ","Comments Required for All Overwrite Adjustments\n(briefly explain adjustment in this limited space but expand as necessary in the larger comment section at bottom of sheet)"]
[null,null,"Completed By:",{"$f":"IF('Wage Earner Income Calculator'!K2=\"\",\"\",'Wage Earner Income Calculator'!K2)","v":""},null,null,null,null,null,null,null,null,null,null,null,null," "]
[null,null,"Date:",{"$f":"'Wage Earner Income Calculator'!C2","v":"2020-01-31"},null,null,null,null,null,null,null,null,null,"2 Year Average",null,null,"Monthly Average","Manual Overwrite Adjustment"]
[null,"II.","Form 2106 - Employee Business Expenses",null,null,null," ",null,null,{"$f":"'Wage Earner Income Calculator'!F61","v":2018},null,null,{"$f":"'Wage Earner Income Calculator'!E61","v":2019}]
[null,1,"Total Expenses line 6 columns A plus B of the 2106 or line 21 of 1040 (which ever is greater)",null,null,null,null,null,"-",null,null,null,null,null,{"$f":"IF(Overwrite=\"\",IF(J7=0,M7,IF(J7>M7,(J7+M7)/2,M7)),-Overwrite)","v":0},{"$f":"IF(Overwrite=\"\", \"\", \"*\")","v":""},{"$f":"O7/12","v":0}]
[null,2,"Automobile Depreciation  \n"]
[null,null,"1. Line 28 if complete OR",null,null,null,null,null,"+",null,null,null,null,null," "]
[null,null,"2. Line 13 miles driven multiplied by depreciation factor for appropriate year.",null,null,null,null,null,"+",null,null,null,null,null," "]
{"$rows_left_out":2}
{"sheet":"Income Red Flag Job Aid","index":6,"n_rows":1,"n_cols":1,"rows_kept":1,"cut":false,"hidden":false,"merged":[[0,0,0,9]]}
["For Reference Purposes Only - Not required to be printed or placed in file "]